BDBM50177437 4-(3-(1-methyl-1,4-diazepane-4-carbonyl)benzyl)phthalazin-1(2H)-one::CHEMBL204132
SMILES CN1CCCN(CC1)C(=O)c1cccc(Cc2n[nH]c(=O)c3ccccc23)c1
InChI Key InChIKey=VBHQNBUGNQIIHH-UHFFFAOYSA-N
Data  1 IC50
  Tab Delimited (TSV)   2D SDfile   Computed 3D by Vconf -m prep SDfile
Find this compound or compounds like it in BindingDB:
Activity Spreadsheet -- Enzyme Inhibition Constant Data from BindingDB
Found 1 hit for monomerid = 50177437
TargetPoly [ADP-ribose] polymerase 1(Homo sapiens (Human))
Kudos Pharmaceuticals
Curated by ChEMBL
LigandPNGBDBM50177437(4-(3-(1-methyl-1,4-diazepane-4-carbonyl)benzyl)pht...)
Affinity DataIC50:  23nM. Assay description: Inhibitory activity against PARP1
In DepthDetails ArticlePubMed