BDBM50177457 4-(3-(1-(3-(3-methoxyphenyl)propanoyl)-1,4-diazepane-4-carbonyl)benzyl)phthalazin-1(2H)-one::CHEMBL383070
SMILES COc1cccc(CCC(=O)N2CCCN(CC2)C(=O)c2cccc(Cc3n[nH]c(=O)c4ccccc34)c2)c1
InChI Key InChIKey=WWVJBOVXGHBKEI-UHFFFAOYSA-N
Data  1 IC50
  Tab Delimited (TSV)   2D SDfile   Computed 3D by Vconf -m prep SDfile
Find this compound or compounds like it in BindingDB:
Activity Spreadsheet -- Enzyme Inhibition Constant Data from BindingDB
Found 1 hit for monomerid = 50177457
TargetPoly [ADP-ribose] polymerase 1(Homo sapiens (Human))
Kudos Pharmaceuticals
Curated by ChEMBL
LigandPNGBDBM50177457(4-(3-(1-(3-(3-methoxyphenyl)propanoyl)-1,4-diazepa...)
Affinity DataIC50:  8nM. Assay description: Inhibitory activity against PARP1
In DepthDetails ArticlePubMed