BDBM50177594 CHEMBL381763::[2-chloro-4-(5-methyl-pyrazol-1-yl)-phenyl]-(5,11-dihydro-benzo[b]pyrido[2,3-e][1,4]diazepin-6-yl)-methanone
SMILES Cc1ccnn1-c1ccc(C(=O)N2Cc3cccnc3Nc3ccccc23)c(Cl)c1
InChI Key InChIKey=ZHQUQIJYLAQQRC-UHFFFAOYSA-N
Data  1 IC50
  Tab Delimited (TSV)   2D SDfile   Computed 3D by Vconf -m prep SDfile
Find this compound or compounds like it in BindingDB:
Activity Spreadsheet -- Enzyme Inhibition Constant Data from BindingDB
Found 1 hit for monomerid = 50177594
TargetVasopressin V2 receptor(Homo sapiens (Human))
Wyeth Research
Curated by ChEMBL
LigandPNGBDBM50177594(CHEMBL381763 | [2-chloro-4-(5-methyl-pyrazol-1-yl)...)
Affinity DataIC50:  390nM. Assay description: Displacement of [3H]AVP from human V2 receptor transfected in LV2 cells
In DepthDetails ArticlePubMed