BDBM50177833 2-(2,2-Difluoroethoxy)-5-{[6-methoxy-7-(2-methoxyethoxy)quinazolin-4-yl]amino}benzo-1,4-quinone::CHEMBL200679
SMILES COCCOc1cc2ncnc(N=C3CC(=O)C(OCC(F)F)=CC3=O)c2cc1OC
InChI Key InChIKey=SPQMCBMMKSULFS-UHFFFAOYSA-N
Data  4 IC50
  Tab Delimited (TSV)   2D SDfile   Computed 3D by Vconf -m prep SDfile
Find this compound or compounds like it in BindingDB:
Activity Spreadsheet -- Enzyme Inhibition Constant Data from BindingDB
Found 4 hits for monomerid = 50177833
TargetVascular endothelial growth factor receptor 2(Homo sapiens (Human))
Wyeth Research
Curated by ChEMBL
LigandPNGBDBM50177833(2-(2,2-Difluoroethoxy)-5-{[6-methoxy-7-(2-methoxye...)
Affinity DataIC50:  33nM. Assay description: Inhibition of poly(Glu4-Tyr)peptide phosphorylation by recombinant VEGFR2 at 10 uM ATP and in presence of 5% mouse plasma
In DepthDetails ArticlePubMed
TargetVascular endothelial growth factor receptor 2(Homo sapiens (Human))
Wyeth Research
Curated by ChEMBL
LigandPNGBDBM50177833(2-(2,2-Difluoroethoxy)-5-{[6-methoxy-7-(2-methoxye...)
Affinity DataIC50:  25nM. Assay description: Inhibition of poly(Glu4-Tyr)peptide phosphorylation by recombinant VEGFR2 at 10 uM ATP and in presence of 5% mouse plasma
In DepthDetails ArticlePubMed
TargetVascular endothelial growth factor receptor 2(Homo sapiens (Human))
Wyeth Research
Curated by ChEMBL
LigandPNGBDBM50177833(2-(2,2-Difluoroethoxy)-5-{[6-methoxy-7-(2-methoxye...)
Affinity DataIC50:  870nM. Assay description: Inhibitory activity against VEGF stimulated autophosphorylation of VEGFR2 expressed in KDR15 cells
In DepthDetails ArticlePubMed
TargetVascular endothelial growth factor receptor 2(Homo sapiens (Human))
Wyeth Research
Curated by ChEMBL
LigandPNGBDBM50177833(2-(2,2-Difluoroethoxy)-5-{[6-methoxy-7-(2-methoxye...)
Affinity DataIC50:  4.5nM. Assay description: Inhibition of poly(Glu4-Tyr)peptide phosphorylation by recombinant VEGFR2 at 10 uM ATP
In DepthDetails ArticlePubMed