BDBM50177850 2-[3-(Ethylamino)phenoxy]-5-{[6-methoxy-7-(2-methoxyethoxy)quinazolin-4-yl]amino}benzo-1,4-quinone::CHEMBL202389
SMILES CCNc1cccc(OC2=CC(=O)C(Nc3ncnc4cc(OCCOC)c(OC)cc34)=CC2=O)c1
InChI Key InChIKey=JBOAWYKUNQTYRJ-UHFFFAOYSA-N
Data  2 IC50
  Tab Delimited (TSV)   2D SDfile   Computed 3D by Vconf -m prep SDfile
Find this compound or compounds like it in BindingDB:
Activity Spreadsheet -- Enzyme Inhibition Constant Data from BindingDB
Found 2 hits for monomerid = 50177850
TargetVascular endothelial growth factor receptor 2(Homo sapiens (Human))
Wyeth Research
Curated by ChEMBL
LigandPNGBDBM50177850(2-[3-(Ethylamino)phenoxy]-5-{[6-methoxy-7-(2-metho...)
Affinity DataIC50:  2.60nM. Assay description: Inhibition of poly(Glu4-Tyr)peptide phosphorylation by recombinant VEGFR2 at 10 uM ATP
In DepthDetails ArticlePubMed
TargetVascular endothelial growth factor receptor 2(Homo sapiens (Human))
Wyeth Research
Curated by ChEMBL
LigandPNGBDBM50177850(2-[3-(Ethylamino)phenoxy]-5-{[6-methoxy-7-(2-metho...)
Affinity DataIC50:  78nM. Assay description: Inhibitory activity against VEGF stimulated autophosphorylation of VEGFR2 expressed in KDR15 cells
In DepthDetails ArticlePubMed