BDBM50178055 CHEMBL198898::N-[4-(2-morpholin-4-yl-4-oxo-4H-chromen-8-yl)phenyl]acetamide
SMILES CC(=O)Nc1ccc(cc1)-c1cccc2c1oc(cc2=O)N1CCOCC1
InChI Key InChIKey=BOYXDPQRSRPWEE-UHFFFAOYSA-N
Data  1 IC50
  Tab Delimited (TSV)   2D SDfile   Computed 3D by Vconf -m prep SDfile
Find this compound or compounds like it in BindingDB:
Activity Spreadsheet -- Enzyme Inhibition Constant Data from BindingDB
Found 1 hit for monomerid = 50178055
TargetDNA-dependent protein kinase catalytic subunit(Homo sapiens (Human))
School Of Natural Sciences--Chemistry
Curated by ChEMBL
LigandPNGBDBM50178055(CHEMBL198898 | N-[4-(2-morpholin-4-yl-4-oxo-4H-chr...)
Affinity DataIC50:  1.20E+3nM. Assay description: Inhibitory activity against DNA-dependent protein kinase receptor
In DepthDetails ArticlePubMed