BDBM50178228 CHEMBL3814255
SMILES Nc1ccc(CC(=O)Nc2nnc(CCCCc3nnc(NC(=O)Cc4ccccc4)s3)s2)cc1
InChI Key InChIKey=PYCLRWJQTHNRKR-UHFFFAOYSA-N
Data  1 IC50
  Tab Delimited (TSV)   2D SDfile   Computed 3D by Vconf -m prep SDfile
Find this compound or compounds like it in BindingDB:
Activity Spreadsheet -- Enzyme Inhibition Constant Data from BindingDB
Found 1 hit for monomerid = 50178228
TargetGlutaminase kidney isoform, mitochondrial(Homo sapiens (Human))
Johns Hopkins University
Curated by ChEMBL
LigandPNGBDBM50178228(CHEMBL3814255)
Affinity DataIC50:  2.30E+3nM. Assay description: Inhibition of human kidney type glutaminase (124 to 669 residues) using L-[3H]-glutamine as substrate after 45 mins by topcount method
In DepthDetails ArticlePubMed