BDBM50178344 CHEMBL3814798
SMILES CNS(=O)(=O)c1ccc(N2CCOCC2)c(Nc2ncnc3[nH]cc(Cl)c23)c1
InChI Key InChIKey=LINMNMJCBXXKNC-UHFFFAOYSA-N
Data  2 IC50
PDB links: 1 PDB ID matches this monomer.
  Tab Delimited (TSV)   2D SDfile   Computed 3D by Vconf -m prep SDfile
Find this compound or compounds like it in BindingDB:
Activity Spreadsheet -- Enzyme Inhibition Constant Data from BindingDB
Found 2 hits for monomerid = 50178344
TargetSerine/threonine-protein kinase B-raf(Homo sapiens (Human))
Glaxosmithkline
Curated by ChEMBL
LigandPNGBDBM50178344(CHEMBL3814798)
Affinity DataIC50:  0.600nM. Assay description: Inhibition of full-length His6-tagged BRAF V600E mutant (2 to 766 residues) (unknown origin) expressed in baculovirus system by B-Raf accelerated MEK...
TargetSerine/threonine-protein kinase TNNI3K(Homo sapiens (Human))
Glaxosmithkline
Curated by ChEMBL
LigandPNGBDBM50178344(CHEMBL3814798)
Affinity DataIC50: <10nM. Assay description: Displacement of 5-({[2-({[3-({4-[(5-hydroxy-2-methylphenyl)amino]-2-pyrimidinyl}amino)phenyl]carbonyl}amino)-ethyl]amino}carbonyl)-2-(6-hydroxy-3-oxo...
In DepthDetails ArticlePubMed