BDBM50178537 4-(5-(4-aminophenyl)thiophen-2-yl)phenol::CHEMBL205824
SMILES Nc1ccc(cc1)-c1ccc(s1)-c1ccc(O)cc1
InChI Key InChIKey=NTAJNMDKXYZMKZ-UHFFFAOYSA-N
Data  1 KI
  Tab Delimited (TSV)   2D SDfile   Computed 3D by Vconf -m prep SDfile
Find this compound or compounds like it in BindingDB:
Activity Spreadsheet -- Enzyme Inhibition Constant Data from BindingDB
Found 1 hit for monomerid = 50178537
TargetAmyloid-beta precursor protein(Homo sapiens (Human))
University Of Pennsylvania
Curated by ChEMBL
LigandPNGBDBM50178537(4-(5-(4-aminophenyl)thiophen-2-yl)phenol | CHEMBL2...)
Affinity DataKi:  9.60nM. Assay description: Displacement of [125I]IMPY from beta amyloid plaque in brain homogenates
In DepthDetails ArticlePubMed