BDBM50178801 CHEMBL198590::N-(5-chloro-2-(phenylthio)phenyl)benzamide
SMILES Clc1ccc(Sc2ccccc2)c(NC(=O)c2ccccc2)c1
InChI Key InChIKey=UHGVBEUDRRTCAK-UHFFFAOYSA-N
Data  1 KI  1 IC50
  Tab Delimited (TSV)   2D SDfile   Computed 3D by Vconf -m prep SDfile
Find this compound or compounds like it in BindingDB:
Activity Spreadsheet -- Enzyme Inhibition Constant Data from BindingDB
Found 2 hits for monomerid = 50178801
TargetTrypanothione reductase(Trypanosoma cruzi)
University Of Manchester
Curated by ChEMBL
LigandPNGBDBM50178801(CHEMBL198590 | N-(5-chloro-2-(phenylthio)phenyl)be...)
Affinity DataKi:  2.45E+4nM. Assay description: Mixed inhibition of trypanothione reductase from Trypanosoma cruzi using TSST substrate
In DepthDetails ArticlePubMed
TargetTrypanothione reductase(Trypanosoma cruzi)
University Of Manchester
Curated by ChEMBL
LigandPNGBDBM50178801(CHEMBL198590 | N-(5-chloro-2-(phenylthio)phenyl)be...)
Affinity DataIC50:  4.96E+4nM. Assay description: Mixed inhibition of trypanothione reductase from Trypanosoma cruzi using TSST substrate
In DepthDetails ArticlePubMed