BDBM50178813 2-amino-4-chloro-phenyl phenyl sulfide::CHEMBL197537
SMILES Nc1cc(Cl)ccc1Sc1ccccc1
InChI Key InChIKey=RIEQPYFIRMWZRX-UHFFFAOYSA-N
Data  1 KI
  Tab Delimited (TSV)   2D SDfile   Computed 3D by Vconf -m prep SDfile
Find this compound or compounds like it in BindingDB:
Activity Spreadsheet -- Enzyme Inhibition Constant Data from BindingDB
Found 1 hit for monomerid = 50178813
TargetTrypanothione reductase(Trypanosoma cruzi)
University Of Manchester
Curated by ChEMBL
LigandPNGBDBM50178813(2-amino-4-chloro-phenyl phenyl sulfide | CHEMBL197...)
Affinity DataKi:  1.50E+5nM. Assay description: Mixed inhibition of trypanothione reductase from Trypanosoma cruzi using TSST substrate
In DepthDetails ArticlePubMed