BDBM50178814 CHEMBL199067::N-(3-(5-chloro-2-(phenylthio)phenylamino)propyl)-N,N-dimethylbenzenaminium
SMILES C[N+](C)(CCCNc1cc(Cl)ccc1Sc1ccccc1)c1ccccc1
InChI Key InChIKey=OKDUGJHFJLEGLC-UHFFFAOYSA-N
Data  1 KI
  Tab Delimited (TSV)   2D SDfile   Computed 3D by Vconf -m prep SDfile
Find this compound or compounds like it in BindingDB:
Activity Spreadsheet -- Enzyme Inhibition Constant Data from BindingDB
Found 1 hit for monomerid = 50178814
TargetTrypanothione reductase(Trypanosoma cruzi)
University Of Manchester
Curated by ChEMBL
LigandPNGBDBM50178814(CHEMBL199067 | N-(3-(5-chloro-2-(phenylthio)phenyl...)
Affinity DataKi:  1.42E+4nM. Assay description: Linear competitive inhibition of trypanothione reductase from Trypanosoma cruzi using (ZCG.dmapa)2 substrate
In DepthDetails ArticlePubMed