BDBM50178944 CHEMBL3814185
SMILES CC(C)(C)c1ccc(Cn2c(cc3sccc23)C(O)=O)cc1
InChI Key InChIKey=DXRXLWDGEYKPAF-UHFFFAOYSA-N
Data  1 IC50
  Tab Delimited (TSV)   2D SDfile   Computed 3D by Vconf -m prep SDfile
Find this compound or compounds like it in BindingDB:
Activity Spreadsheet -- Enzyme Inhibition Constant Data from BindingDB
Found 1 hit for monomerid = 50178944
TargetC-C chemokine receptor type 9(Homo sapiens (Human))
Cubist Pharmaceuticals
Curated by ChEMBL
LigandPNGBDBM50178944(CHEMBL3814185)
Affinity DataIC50:  232nM. Assay description: Antagonist activity at CCR9 (unknown origin) assessed as inhibition of TECK-stimulated calcium mobilization preincubated for 10 mins followed by agon...
In DepthDetails ArticlePubMed