BDBM50179027 1-(4-acetylphenyl)-3-(9-((2R,3R,4S,5S)-5-(ethylcarbamoyl)-3,4-dihydroxy-tetrahydrofuran-2-yl)-9H-purin-6-yl)urea::CHEMBL203812
SMILES CCNC(=O)[C@H]1O[C@H]([C@H](O)[C@@H]1O)n1cnc2c(NC(=O)Nc3ccc(cc3)C(C)=O)ncnc12
InChI Key InChIKey=MDGCYCQCRVUEGF-KSVNGYGVSA-N
Data  4 KI
  Tab Delimited (TSV)   2D SDfile   Computed 3D by Vconf -m prep SDfile
Find this compound or compounds like it in BindingDB:
Activity Spreadsheet -- Enzyme Inhibition Constant Data from BindingDB
Found 4 hits for monomerid = 50179027
TargetAdenosine receptor A3(Rattus norvegicus)
Vigo University
Curated by ChEMBL
LigandPNGBDBM50179027(1-(4-acetylphenyl)-3-(9-((2R,3R,4S,5S)-5-(ethylcar...)
Affinity DataKi:  20.9nM. Assay description: Displacement of [125I]AB-MECA from rat adenosine A3 receptor expressed in CHO cells
In DepthDetails ArticlePubMed
TargetAdenosine receptor A3(Rattus norvegicus)
Vigo University
Curated by ChEMBL
LigandPNGBDBM50179027(1-(4-acetylphenyl)-3-(9-((2R,3R,4S,5S)-5-(ethylcar...)
Affinity DataKi:  21nM. Assay description: Binding affinity against rat adenosine A3 receptor expressed in CHO cells using [125I]-.
In DepthDetails ArticlePubMed
TargetAdenosine receptor A1(Rattus norvegicus (rat))
Universit£
Curated by ChEMBL
LigandPNGBDBM50179027(1-(4-acetylphenyl)-3-(9-((2R,3R,4S,5S)-5-(ethylcar...)
Affinity DataKi:  73nM. Assay description: Binding affinity against adenosine A1 receptor in rat brain membranes using [3H]R-PIA.
In DepthDetails ArticlePubMed
TargetAdenosine receptor A2a(Rattus norvegicus (rat))
Universit£
Curated by ChEMBL
LigandPNGBDBM50179027(1-(4-acetylphenyl)-3-(9-((2R,3R,4S,5S)-5-(ethylcar...)
Affinity DataKi:  1.05E+3nM. Assay description: Binding affinity against adenosine A2A receptor in rat striatal membranes using [3H]-CGS- 21680.
In DepthDetails ArticlePubMed