BDBM50179030 (2S,3S,4R,5R)-3,4-Dihydroxy-5-(6-{3-[4-(pyridin-2-ylsulfamoyl)-phenyl]-ureido}-purin-9-yl)-tetrahydro-furan-2-carboxylic acid ethylamide::CHEMBL380943
SMILES CCNC(=O)[C@H]1O[C@H]([C@H](O)[C@@H]1O)n1cnc2c(NC(=O)Nc3ccc(cc3)S(=O)(=O)Nc3ccccn3)ncnc12
InChI Key InChIKey=GMZSVEGPESZJKL-QPXQOZNCSA-N
Data  3 KI
  Tab Delimited (TSV)   2D SDfile   Computed 3D by Vconf -m prep SDfile
Find this compound or compounds like it in BindingDB:
Activity Spreadsheet -- Enzyme Inhibition Constant Data from BindingDB
Found 3 hits for monomerid = 50179030
TargetAdenosine receptor A3(Rattus norvegicus)
Vigo University
Curated by ChEMBL
LigandPNGBDBM50179030((2S,3S,4R,5R)-3,4-Dihydroxy-5-(6-{3-[4-(pyridin-2-...)
Affinity DataKi:  54.1nM. Assay description: Displacement of [125I]AB-MECA from rat adenosine A3 receptor expressed in CHO cells
In DepthDetails ArticlePubMed
TargetAdenosine receptor A3(Rattus norvegicus)
Vigo University
Curated by ChEMBL
LigandPNGBDBM50179030((2S,3S,4R,5R)-3,4-Dihydroxy-5-(6-{3-[4-(pyridin-2-...)
Affinity DataKi:  54.1nM. Assay description: Displacement of radioligand [125I]AB-MECA binding at rat A3 receptor expressed in CHO cells
In DepthDetails ArticlePubMed
TargetAdenosine receptor A1(Rattus norvegicus (rat))
Experimental Sugar Cane Station
Curated by ChEMBL
LigandPNGBDBM50179030((2S,3S,4R,5R)-3,4-Dihydroxy-5-(6-{3-[4-(pyridin-2-...)
Affinity DataKi:  292nM. Assay description: Inhibition of [3H]R-PIA binding to Adenosine A1 receptor from rat brain membrane
In DepthDetails ArticlePubMed