BDBM50179033 (2S,3S,4R,5R)-5-(6-(2-chlorobenzamido)-9H-purin-9-yl)-N-ethyl-3,4-dihydroxy-tetrahydrofuran-2-carboxamide::CHEMBL437506
SMILES CCNC(=O)[C@H]1O[C@H]([C@H](O)[C@@H]1O)n1cnc2c(NC(=O)c3ccccc3Cl)ncnc12
InChI Key InChIKey=MNYDMFMNLHBJHR-SSHHRWTQSA-N
Data  4 KI
  Tab Delimited (TSV)   2D SDfile   Computed 3D by Vconf -m prep SDfile
Find this compound or compounds like it in BindingDB:
Activity Spreadsheet -- Enzyme Inhibition Constant Data from BindingDB
Found 4 hits for monomerid = 50179033
TargetAdenosine receptor A3(Rattus norvegicus)
Universit£
Curated by ChEMBL
LigandPNGBDBM50179033((2S,3S,4R,5R)-5-(6-(2-chlorobenzamido)-9H-purin-9-...)
Affinity DataKi:  754nM. Assay description: Binding affinity against rat adenosine A3 receptor expressed in CHO cells using [125I]-.
In DepthDetails ArticlePubMed
TargetAdenosine receptor A3(Rattus norvegicus)
Universit£
Curated by ChEMBL
LigandPNGBDBM50179033((2S,3S,4R,5R)-5-(6-(2-chlorobenzamido)-9H-purin-9-...)
Affinity DataKi:  754nM. Assay description: Displacement of [125I]AB-MECA from rat adenosine A3 receptor expressed in CHO cells
In DepthDetails ArticlePubMed
TargetAdenosine receptor A1(Rattus norvegicus (rat))
Universit£
Curated by ChEMBL
LigandPNGBDBM50179033((2S,3S,4R,5R)-5-(6-(2-chlorobenzamido)-9H-purin-9-...)
Affinity DataKi:  1.17E+3nM. Assay description: Binding affinity against adenosine A1 receptor in rat brain membranes using [3H]R-PIA.
In DepthDetails ArticlePubMed
TargetAdenosine receptor A2a(Rattus norvegicus (rat))
Universit£
Curated by ChEMBL
LigandPNGBDBM50179033((2S,3S,4R,5R)-5-(6-(2-chlorobenzamido)-9H-purin-9-...)
Affinity DataKi:  1.96E+3nM. Assay description: Binding affinity against adenosine A2A receptor in rat striatal membranes using [3H]-CGS- 21680.
In DepthDetails ArticlePubMed