BDBM50179668 1-(1-methyl-4-oxoimidazolidin-2-ylidene)-3-(thiophen-2-yl)urea::CHEMBL382681
SMILES Cn1cc(O)nc1NC(=O)Nc1cccs1
InChI Key InChIKey=YBOIEFONHBPSTO-UHFFFAOYSA-N
Data  1 IC50
  Tab Delimited (TSV)   2D SDfile   Computed 3D by Vconf -m prep SDfile
Find this compound or compounds like it in BindingDB:
Activity Spreadsheet -- Enzyme Inhibition Constant Data from BindingDB
Found 1 hit for monomerid = 50179668
TargetMetabotropic glutamate receptor 5(Homo sapiens (Human))
Astrazeneca R&D
Curated by ChEMBL
LigandPNGBDBM50179668(1-(1-methyl-4-oxoimidazolidin-2-ylidene)-3-(thioph...)
Affinity DataIC50:  4.90E+3nM. Assay description: Inhibition of glutamate-induced calcium influx in human mGluR5d by FLIPR
In DepthDetails ArticlePubMed