BDBM50180051 (R)-4-(4-methylpentanoyl)-8-(4-methylpentylidene)-1-thia-4-azaspiro[4.5]decane-3-carboxylic acid::CHEMBL371446
SMILES CC(C)CCC=C1CCC2(CC1)SC[C@H](N2C(=O)CCC(C)C)C(O)=O
InChI Key InChIKey=QZYRRGACMDRZDK-WAGHLKAASA-N
Data  2 IC50
  Tab Delimited (TSV)   2D SDfile   Computed 3D by Vconf -m prep SDfile
Find this compound or compounds like it in BindingDB:
Activity Spreadsheet -- Enzyme Inhibition Constant Data from BindingDB
Found 2 hits for monomerid = 50180051
TargetProtein c-Fos/Transcription factor Jun(Homo sapiens (Human))
Toyama Chemical
Curated by ChEMBL
LigandPNGBDBM50180051((R)-4-(4-methylpentanoyl)-8-(4-methylpentylidene)-...)
Affinity DataIC50:  6.50E+5nM. Assay description: Inhibitory activity on AP1 using ELISA based AP1 DNA binding
In DepthDetails ArticlePubMed
TargetProtein c-Fos/Transcription factor Jun(Homo sapiens (Human))
Toyama Chemical
Curated by ChEMBL
LigandPNGBDBM50180051((R)-4-(4-methylpentanoyl)-8-(4-methylpentylidene)-...)
Affinity DataIC50:  1.18E+4nM. Assay description: Inhibition of the expression of AP1-luciferase by TPA-stimulated NIH3T3 cells
In DepthDetails ArticlePubMed