BDBM50180185 10-{[(1R,9R)-17-(cyclobutylmethyl)-17-azatetracyclo[7.5.3.0^{1,10}.0^{2,7}]heptadeca-2,4,6-trien-4-yl]oxy}-10-oxodecanoic acid::CHEMBL383320::sebacic acid 10-((-)-N-cyclobutylmethylmorphinan-3-yl) ester
SMILES OC(=O)CCCCCCCCC(=O)Oc1ccc2C[C@@H]3C4CCCC[C@]4(CCN3CC3CCC3)c2c1
InChI Key InChIKey=BAHBDPWIXMBTRC-QQXLIOKXSA-N
Data  3 KI  4 EC50
  Tab Delimited (TSV)   2D SDfile   Computed 3D by Vconf -m prep SDfile
Find this compound or compounds like it in BindingDB:
Activity Spreadsheet -- Enzyme Inhibition Constant Data from BindingDB
Found 7 hits for monomerid = 50180185
TargetKappa-type opioid receptor(Homo sapiens (Human))
Harvard Medical School
Curated by ChEMBL
LigandPNGBDBM50180185(10-{[(1R,9R)-17-(cyclobutylmethyl)-17-azatetracycl...)
Affinity DataKi:  0.290nM. Assay description: Displacement of [3H]U69593 from human kappa opioid receptor expressed in CHO cells
In DepthDetails ArticlePubMed
TargetMu-type opioid receptor(Homo sapiens (Human))
Harvard Medical School
Curated by ChEMBL
LigandPNGBDBM50180185(10-{[(1R,9R)-17-(cyclobutylmethyl)-17-azatetracycl...)
Affinity DataKi:  0.710nM. Assay description: Displacement of [3H]DAMGO from human mu opioid receptor expressed in CHO cells
In DepthDetails ArticlePubMed
TargetDelta-type opioid receptor(Homo sapiens (Human))
Harvard Medical School
Curated by ChEMBL
LigandPNGBDBM50180185(10-{[(1R,9R)-17-(cyclobutylmethyl)-17-azatetracycl...)
Affinity DataKi:  18nM. Assay description: Displacement of [3H]naltrindole from human delta opioid receptor expressed in CHO cells
In DepthDetails ArticlePubMed
TargetMu-type opioid receptor(Homo sapiens (Human))
Harvard Medical School
Curated by ChEMBL
LigandPNGBDBM50180185(10-{[(1R,9R)-17-(cyclobutylmethyl)-17-azatetracycl...)
Affinity DataEC50:  3nM. Assay description: Agonist activity at human opioid gamma receptor expressed in CHO cells assessed as stimulation of [35S]GTP-gamma-S binding
In DepthDetails ArticlePubMed
TargetMu-type opioid receptor(Homo sapiens (Human))
Harvard Medical School
Curated by ChEMBL
LigandPNGBDBM50180185(10-{[(1R,9R)-17-(cyclobutylmethyl)-17-azatetracycl...)
Affinity DataEC50:  3nM. Assay description: Activity at human mu opioid receptor expressed in CHO cells by [35S]GTP-gamma-S binding assay
In DepthDetails ArticlePubMed
TargetKappa-type opioid receptor(Homo sapiens (Human))
Harvard Medical School
Curated by ChEMBL
LigandPNGBDBM50180185(10-{[(1R,9R)-17-(cyclobutylmethyl)-17-azatetracycl...)
Affinity DataEC50:  28nM. Assay description: Agonist activity at human opioid kappa receptor expressed in CHO cells assessed as stimulation of [35S]GTPgammaS binding
In DepthDetails ArticlePubMed
TargetKappa-type opioid receptor(Homo sapiens (Human))
Harvard Medical School
Curated by ChEMBL
LigandPNGBDBM50180185(10-{[(1R,9R)-17-(cyclobutylmethyl)-17-azatetracycl...)
Affinity DataEC50:  2.80nM. Assay description: Displacement of [3H]U69593 from human kappa opioid receptor expressed in CHO cells
In DepthDetails ArticlePubMed