BDBM50180198 (2S,3S,4R,5R)-5-[2-chloro-6-(2-methyl-benzylamino)-purin-9-yl]-3,4-dihydroxy-tetrahydro-thiophene-2-carboxylic acid methylamide::CHEMBL370187
SMILES CNC(=O)[C@H]1S[C@H]([C@H](O)[C@@H]1O)n1cnc2c(NCc3ccccc3C)nc(Cl)nc12
InChI Key InChIKey=HYMVDRPLNPGRAA-MOROJQBDSA-N
Data  3 KI
  Tab Delimited (TSV)   2D SDfile   Computed 3D by Vconf -m prep SDfile
Find this compound or compounds like it in BindingDB:
Activity Spreadsheet -- Enzyme Inhibition Constant Data from BindingDB
Found 3 hits for monomerid = 50180198
TargetAdenosine receptor A3(Homo sapiens (Human))
Ewha Womans University
Curated by ChEMBL
LigandPNGBDBM50180198((2S,3S,4R,5R)-5-[2-chloro-6-(2-methyl-benzylamino)...)
Affinity DataKi:  2.18nM. Assay description: Displacement of [125I]AB-MECA from human adenosine A3 receptor transfected in CHO cells
In DepthDetails ArticlePubMed
TargetAdenosine receptor A1(Homo sapiens (Human))
Ewha Womans University
Curated by ChEMBL
LigandPNGBDBM50180198((2S,3S,4R,5R)-5-[2-chloro-6-(2-methyl-benzylamino)...)
Affinity DataKi:  507nM. Assay description: Displacement of [3H]R-PIA from human adenosine A1 receptor transfected in CHO cells
In DepthDetails ArticlePubMed
TargetAdenosine receptor A2a(Homo sapiens (Human))
Ewha Womans University
Curated by ChEMBL
LigandPNGBDBM50180198((2S,3S,4R,5R)-5-[2-chloro-6-(2-methyl-benzylamino)...)
Affinity DataKi:  1.32E+3nM. Assay description: Displacement of [3H]CGS21680 from human adenosine A2A receptor transfected in HEK293 cells
In DepthDetails ArticlePubMed