BDBM50180248 CHEMBL3813924
SMILES Nc1ccc(cc1)C(=O)Nc1nnc(s1)S(N)(=O)=O
InChI Key InChIKey=HNFIGQWLNNIMIU-UHFFFAOYSA-N
Data  4 KI
  Tab Delimited (TSV)   2D SDfile   Computed 3D by Vconf -m prep SDfile
Find this compound or compounds like it in BindingDB:
Activity Spreadsheet -- Enzyme Inhibition Constant Data from BindingDB
Found 4 hits for monomerid = 50180248
TargetCarbonic anhydrase 7(Homo sapiens (Human))
Dumlupinar University
Curated by ChEMBL
LigandPNGBDBM50180248(CHEMBL3813924)
Affinity DataKi:  1.30nM. Assay description: Inhibition of human recombinant membrane bound CA7 expressed in Escherichia coli preincubated for 15 mins by stopped-flow CO2 hydration assay
In DepthDetails ArticlePubMed
TargetCarbonic anhydrase 2(Homo sapiens (Human))
Dumlupinar University
Curated by ChEMBL
LigandPNGBDBM50180248(CHEMBL3813924)
Affinity DataKi:  2.80nM. Assay description: Inhibition of human recombinant CA2 expressed in Escherichia coli preincubated for 15 mins by stopped-flow CO2 hydration assay
In DepthDetails ArticlePubMed
TargetCarbonic anhydrase 4(Homo sapiens (Human))
Dumlupinar University
Curated by ChEMBL
LigandPNGBDBM50180248(CHEMBL3813924)
Affinity DataKi:  30nM. Assay description: Inhibition of human recombinant CA4 expressed in Escherichia coli preincubated for 15 mins by stopped-flow CO2 hydration assay
In DepthDetails ArticlePubMed
TargetCarbonic anhydrase 1(Homo sapiens (Human))
Dumlupinar University
Curated by ChEMBL
LigandPNGBDBM50180248(CHEMBL3813924)
Affinity DataKi:  64nM. Assay description: Inhibition of human recombinant CA1 expressed in Escherichia coli preincubated for 15 mins by stopped-flow CO2 hydration assay
In DepthDetails ArticlePubMed