BDBM50180338 2-(3-Phenylpropylamino)-6-(3-acetamidophenyl)pyrazine::CHEMBL200130
SMILES CC(=O)Nc1cccc(c1)-c1cncc(NCCCc2ccccc2)n1
InChI Key InChIKey=NBTVCGJHKNPKQV-UHFFFAOYSA-N
Data  2 IC50
  Tab Delimited (TSV)   2D SDfile   Computed 3D by Vconf -m prep SDfile
Find this compound or compounds like it in BindingDB:
Activity Spreadsheet -- Enzyme Inhibition Constant Data from BindingDB
Found 2 hits for monomerid = 50180338
TargetSerine/threonine-protein kinase B-raf(Homo sapiens (Human))
Institute Of Cancer Research
Curated by ChEMBL
LigandPNGBDBM50180338(2-(3-Phenylpropylamino)-6-(3-acetamidophenyl)pyraz...)
Affinity DataIC50: >1.00E+5nM. Assay description: Inhibitory activity against human B-RAF
In DepthDetails ArticlePubMed
TargetSerine/threonine-protein kinase B-raf(Homo sapiens (Human))
Institute Of Cancer Research
Curated by ChEMBL
LigandPNGBDBM50180338(2-(3-Phenylpropylamino)-6-(3-acetamidophenyl)pyraz...)
Affinity DataIC50:  3.30E+4nM. Assay description: Growth inhibition in human melanoma cells WM266.4 expressing mutant B-RAF with SRB
In DepthDetails ArticlePubMed