BDBM50180379 2-(6-(7-(trifluoromethyl)imidazo[1,2-a]pyrimidin-3-yl)pyridin-2-yl)benzonitrile::CHEMBL203591
SMILES FC(F)(F)c1ccn2c(cnc2n1)-c1cccc(n1)-c1ccccc1C#N
InChI Key InChIKey=AZLLXOVNVMQRNP-UHFFFAOYSA-N
Data  2 KI
  Tab Delimited (TSV)   2D SDfile   Computed 3D by Vconf -m prep SDfile
Find this compound or compounds like it in BindingDB:
Activity Spreadsheet -- Enzyme Inhibition Constant Data from BindingDB
Found 2 hits for monomerid = 50180379
TargetGamma-aminobutyric acid receptor subunit alpha-1/beta-3/gamma-2(Homo sapiens (Human))
Merck Sharp And Dohme Research Laboratories
Curated by ChEMBL
LigandPNGBDBM50180379(2-(6-(7-(trifluoromethyl)imidazo[1,2-a]pyrimidin-3...)
Affinity DataKi:  0.360nM. Assay description: Displacement of [3H]Ro 15-1788 from recombinant human GABA-Aalpha1 receptor plus beta3gamma2 expressed in L(tk-) cells
Target InfoGoogleScholar
In DepthDetails ArticlePubMed
TargetGamma-aminobutyric acid receptor subunit alpha-3/beta-3/gamma-2(Homo sapiens (Human))
Merck Sharp And Dohme Research Laboratories
Curated by ChEMBL
LigandPNGBDBM50180379(2-(6-(7-(trifluoromethyl)imidazo[1,2-a]pyrimidin-3...)
Affinity DataKi:  0.460nM. Assay description: Displacement of [3H]Ro 15-1788 from recombinant human GABA-Aalpha3 receptor plus beta3gamma2 expressed in L(tk-) cells
In DepthDetails ArticlePubMed