BDBM50180415 CHEMBL3814530
SMILES Oc1c(cnc2c(F)cccc12)C(=O)N\N=C\c1ccc(F)cc1
InChI Key InChIKey=UAMQOKGVCZFDGT-ODCIPOBUSA-N
Data  1 IC50
  Tab Delimited (TSV)   2D SDfile   Computed 3D by Vconf -m prep SDfile
Find this compound or compounds like it in BindingDB:
Activity Spreadsheet -- Enzyme Inhibition Constant Data from BindingDB
Found 1 hit for monomerid = 50180415
TargetBeta-glucuronidase(Homo sapiens (Human))
Universiti Teknologi Mara (Uitm)
Curated by ChEMBL
LigandPNGBDBM50180415(CHEMBL3814530)
Affinity DataIC50:  2.63E+4nM. Assay description: Inhibition of beta-glucuronidase (unknown origin) using p-nitrophenyl-beta-D-glucuronide as substrate assessed as formation of p-nitrophenol incubate...
In DepthDetails ArticlePubMed