BDBM50180628 CHEMBL3814113
SMILES OB(O)c1ccccc1OCc1ccccc1
InChI Key InChIKey=MCAIDINWZOCYQK-UHFFFAOYSA-N
Data  1 IC50
  Tab Delimited (TSV)   2D SDfile   Computed 3D by Vconf -m prep SDfile
Find this compound or compounds like it in BindingDB:
Activity Spreadsheet -- Enzyme Inhibition Constant Data from BindingDB
Found 1 hit for monomerid = 50180628
TargetHormone-sensitive lipase(Homo sapiens (Human))
Daiichi Sankyo
Curated by ChEMBL
LigandPNGBDBM50180628(CHEMBL3814113)
Affinity DataIC50:  130nM. Assay description: Inhibition of recombinant human HSL expressed in Sf9 insect cells using PNPB as substrate measured after 5 mins by spectrophotometric method
In DepthDetails ArticlePubMed