BDBM50180990 1,12-Bis(N-methylmorpholinium)dodecane dibromide::CHEMBL201539
SMILES C[N+]1(CCCCCCCCCCCC[N+]2(C)CCOCC2)CCOCC1
InChI Key InChIKey=RWKTWTWPAAUDTL-UHFFFAOYSA-N
Data  1 IC50
  Tab Delimited (TSV)   2D SDfile   Computed 3D by Vconf -m prep SDfile
Find this compound or compounds like it in BindingDB:
Activity Spreadsheet -- Enzyme Inhibition Constant Data from BindingDB
Found 1 hit for monomerid = 50180990
TargetPhospholipase B(Cryptococcus neoformans)
The University Of Sydney
Curated by ChEMBL
LigandPNGBDBM50180990(1,12-Bis(N-methylmorpholinium)dodecane dibromide |...)
Affinity DataIC50: >2.50E+5nM. Assay description: Inhibition of Cryptococccus neoformans H99 PLB1activity
In DepthDetails ArticlePubMed