BDBM50180993 1,12-Bis(tripropyl ammonium)dodecane dibromide::CHEMBL201015
SMILES CCC[N+](CCC)(CCC)CCCCCCCCCCCC[N+](CCC)(CCC)CCC
InChI Key InChIKey=UZFBFLPJRXOBSC-UHFFFAOYSA-N
Data  1 IC50
  Tab Delimited (TSV)   2D SDfile   Computed 3D by Vconf -m prep SDfile
Find this compound or compounds like it in BindingDB:
Activity Spreadsheet -- Enzyme Inhibition Constant Data from BindingDB
Found 1 hit for monomerid = 50180993
TargetPhospholipase B(Cryptococcus neoformans)
The University Of Sydney
Curated by ChEMBL
LigandPNGBDBM50180993(1,12-Bis(tripropyl ammonium)dodecane dibromide | C...)
Affinity DataIC50:  7.00E+3nM. Assay description: Inhibition of Cryptococccus neoformans H99 PLB1activity
In DepthDetails ArticlePubMed