BDBM50181044 2-(3-(piperidin-1-yl)propyl)-2H-isoindole-1-carbonitrile::CHEMBL207921
SMILES N#Cc1n(CCCN2CCCCC2)cc2ccccc12
InChI Key InChIKey=ZCPCLXNBSZGQIT-UHFFFAOYSA-N
Data  1 KI
  Tab Delimited (TSV)   2D SDfile   Computed 3D by Vconf -m prep SDfile
Find this compound or compounds like it in BindingDB:
Activity Spreadsheet -- Enzyme Inhibition Constant Data from BindingDB
Found 1 hit for monomerid = 50181044
TargetHistamine H3 receptor(Homo sapiens (Human))
Johann Wolfgang Goethe-UniversitäT
Curated by ChEMBL
LigandPNGBDBM50181044(2-(3-(piperidin-1-yl)propyl)-2H-isoindole-1-carbon...)
Affinity DataKi:  351nM. Assay description: Displacement of [125I]iodoproxyfan from human histamine H3 receptor expressed in CHOK1 cells
In DepthDetails ArticlePubMed