BDBM50181071 2-[3-methyl-5-(4-methyl-benzyloxy)-phenyl]-isoindole-1,3-dione::CHEMBL205310
SMILES Cc1ccc(COc2cc(C)cc(c2)N2C(=O)c3ccccc3C2=O)cc1
InChI Key InChIKey=FFJXZFIIPRSDPF-UHFFFAOYSA-N
Data  1 KI
  Tab Delimited (TSV)   2D SDfile   Computed 3D by Vconf -m prep SDfile
Find this compound or compounds like it in BindingDB:
Activity Spreadsheet -- Enzyme Inhibition Constant Data from BindingDB
Found 1 hit for monomerid = 50181071
TargetMetabotropic glutamate receptor 5(Homo sapiens (Human))
F. Hoffmann-La Roche
Curated by ChEMBL
LigandPNGBDBM50181071(2-[3-methyl-5-(4-methyl-benzyloxy)-phenyl]-isoindo...)
Affinity DataKi: >1.00E+4nM. Assay description: Displacement of [3H]MPEP from recombinant human mGlu5 receptor
In DepthDetails ArticlePubMed