BDBM50181121 CHEMBL381333::N,2-dicyclopropyl-6-(4,4-dimethylpiperidin-1-yl)-5-methylpyrimidin-4-amine
SMILES Cc1c(NC2CC2)nc(nc1N1CCC(C)(C)CC1)C1CC1
InChI Key InChIKey=CZSPDYBKOUOJCH-UHFFFAOYSA-N
Data  1 KI
  Tab Delimited (TSV)   2D SDfile   Computed 3D by Vconf -m prep SDfile
Find this compound or compounds like it in BindingDB:
Activity Spreadsheet -- Enzyme Inhibition Constant Data from BindingDB
Found 1 hit for monomerid = 50181121
TargetMuscarinic acetylcholine receptor M3(Homo sapiens (Human))
Ucb Pharma
Curated by ChEMBL
LigandPNGBDBM50181121(CHEMBL381333 | N,2-dicyclopropyl-6-(4,4-dimethylpi...)
Affinity DataKi:  25nM. Assay description: Displacement of [3H]methylscopolamine from recombinant human muscarinic M3 receptors expressed in CHO cells
In DepthDetails ArticlePubMed