BDBM50181542 CHEMBL373013::N-(3-fluorophenyl)-2-(2-(7-(3-(2-hydroxyethylamino)propoxy)-6-methoxyquinazolin-4-ylamino)thiazol-5-yl)acetamide
SMILES COc1cc2c(Nc3ncc(CC(=O)Nc4cccc(F)c4)s3)ncnc2cc1OCCCNCCO
InChI Key InChIKey=UZWFLOSUVZITCB-UHFFFAOYSA-N
Data  1 IC50
  Tab Delimited (TSV)   2D SDfile   Computed 3D by Vconf -m prep SDfile
Find this compound or compounds like it in BindingDB:
Activity Spreadsheet -- Enzyme Inhibition Constant Data from BindingDB
Found 1 hit for monomerid = 50181542
TargetAurora kinase A(Homo sapiens (Human))
Astrazeneca
Curated by ChEMBL
LigandPNGBDBM50181542(CHEMBL373013 | N-(3-fluorophenyl)-2-(2-(7-(3-(2-hy...)
Affinity DataIC50:  5nM. Assay description: In vitro inhibition constant for Aurora-A
In DepthDetails ArticlePubMed