BDBM50181824 3,3'-Diiodothyronamine::CHEMBL383495
SMILES NCCc1ccc(Oc2ccc(O)c(I)c2)c(I)c1
InChI Key InChIKey=RKRRCKUQQDVLGU-UHFFFAOYSA-N
Data  2 EC50
  Tab Delimited (TSV)   2D SDfile   Computed 3D by Vconf -m prep SDfile
Find this compound or compounds like it in BindingDB:
Activity Spreadsheet -- Enzyme Inhibition Constant Data from BindingDB
Found 2 hits for monomerid = 50181824
TargetTrace amine-associated receptor 1(Rattus norvegicus (Rat))
University Of California San Francisco
Curated by ChEMBL
LigandPNGBDBM50181824(3,3'-Diiodothyronamine | CHEMBL383495)
Affinity DataEC50:  41nM. Assay description: Activity at rat TAAR1 by measuring cAMP accumulation in HEK293 cells
In DepthDetails ArticlePubMed
TargetTrace amine-associated receptor 1(Mus musculus (Mouse))
University Of California San Francisco
Curated by ChEMBL
LigandPNGBDBM50181824(3,3'-Diiodothyronamine | CHEMBL383495)
Affinity DataEC50:  1.00E+3nM. Assay description: Activity at mouse TAAR1 by measuring cAMP accumulation in HEK293 cells
In DepthDetails ArticlePubMed