BDBM50181887 CHEMBL202509::N-[4-(4-acetylpiperazin-1-yl)benzoyl]-3-nitro-4-(2-phenylsulfanylethylamino)benzenesulfonamide
SMILES CC(=O)N1CCN(CC1)c1ccc(cc1)C(=O)NS(=O)(=O)c1ccc(NCCSc2ccccc2)c(c1)[N+]([O-])=O
InChI Key InChIKey=VLWWWTRWUSFASP-UHFFFAOYSA-N
Data  3 KI
  Tab Delimited (TSV)   2D SDfile   Computed 3D by Vconf -m prep SDfile
Find this compound or compounds like it in BindingDB:
Activity Spreadsheet -- Enzyme Inhibition Constant Data from BindingDB
Found 3 hits for monomerid = 50181887
TargetBcl-2-like protein 1(Homo sapiens (Human))
Abbott Laboratories
Curated by ChEMBL
LigandPNGBDBM50181887(CHEMBL202509 | N-[4-(4-acetylpiperazin-1-yl)benzoy...)
Affinity DataKi:  894nM. Assay description: Binding affinity to Bcl-XL by fluorescence polarization assay
In DepthDetails ArticlePubMed
TargetBcl-2-like protein 1(Homo sapiens (Human))
Abbott Laboratories
Curated by ChEMBL
LigandPNGBDBM50181887(CHEMBL202509 | N-[4-(4-acetylpiperazin-1-yl)benzoy...)
Affinity DataKi:  2.97E+3nM. Assay description: Binding affinity to Bcl-XL in 1% human serum by fluorescence polarization assay
In DepthDetails ArticlePubMed
TargetApoptosis regulator Bcl-2(Homo sapiens (Human))
Abbott Laboratories
Curated by ChEMBL
LigandPNGBDBM50181887(CHEMBL202509 | N-[4-(4-acetylpiperazin-1-yl)benzoy...)
Affinity DataKi: >1.00E+4nM. Assay description: Binding affinity to Bcl2 by fluorescence polarization assay
In DepthDetails ArticlePubMed