BDBM50182023 CHEMBL3818783
SMILES Cc1cccc(CSc2nc3c(nc(N)[nH]c3=O)[nH]2)c1
InChI Key InChIKey=XTQPIMUKZFTRHV-UHFFFAOYSA-N
Data  2 Kd
  Tab Delimited (TSV)   2D SDfile   Computed 3D by Vconf -m prep SDfile
Find this compound or compounds like it in BindingDB:
Activity Spreadsheet -- Enzyme Inhibition Constant Data from BindingDB
Found 2 hits for monomerid = 50182023
Target2-amino-4-hydroxy-6-hydroxymethyldihydropteridine pyrophosphokinase(Escherichia coli (strain K12))
Monash University
Curated by ChEMBL
LigandPNGBDBM50182023(CHEMBL3818783)
Affinity DataKd:  1.70E+3nM. Assay description: Binding affinity to biotinylated Escherichia coli HPPK expressed in Escherichia coli BL21 (DE3) in presence of 1 mM ATP by SPR assay
In DepthDetails ArticlePubMed
Target2-amino-4-hydroxy-6-hydroxymethyldihydropteridine diphosphokinase(Staphylococcus aureus)
Monash University
Curated by ChEMBL
LigandPNGBDBM50182023(CHEMBL3818783)
Affinity DataKd:  380nM. Assay description: Binding affinity to biotinylated Staphylococcus aureus HPPK in presence of 1 mM ATP by SPR assay
In DepthDetails ArticlePubMed