BDBM50182037 CHEMBL3818416
SMILES OC(=O)c1cn(Cc2ccc(Cl)cc2)cc(O)c1=O
InChI Key InChIKey=APBIQOYOKJLXSK-UHFFFAOYSA-N
Data  1 IC50
  Tab Delimited (TSV)   2D SDfile   Computed 3D by Vconf -m prep SDfile
Find this compound or compounds like it in BindingDB:
Activity Spreadsheet -- Enzyme Inhibition Constant Data from BindingDB
Found 1 hit for monomerid = 50182037
TargetReverse transcriptase(Human immunodeficiency virus 1)
University Of Minnesota
Curated by ChEMBL
LigandPNGBDBM50182037(CHEMBL3818416)
Affinity DataIC50: >2.50E+4nM. Assay description: Inhibition of HIV-1 RT RNA-dependent DNA polymerase activity expressed in Escherichia coli JM109 using [3H]TTP/ poly(rA)-oligo(dT)16 as substrate inc...
In DepthDetails ArticlePubMed