BDBM50182120 1-(3-(4-bromophenyl)-5-(methylsulfonyl)-4,5,6,7-tetrahydropyrazolo[4,3-c]pyridin-1-yl)-3-(4-(3,4-dihydroquinolin-1(2H)-yl)piperidin-1-yl)propan-2-ol::CHEMBL208131
SMILES CS(=O)(=O)N1CCc2c(C1)c(nn2CC(O)CN1CCC(CC1)N1CCCc2ccccc12)-c1ccc(Br)cc1
InChI Key InChIKey=QGFWMCFQLODLJF-UHFFFAOYSA-N
Data  1 IC50
  Tab Delimited (TSV)   2D SDfile   Computed 3D by Vconf -m prep SDfile
Find this compound or compounds like it in BindingDB:
Activity Spreadsheet -- Enzyme Inhibition Constant Data from BindingDB
Found 1 hit for monomerid = 50182120
TargetCathepsin S(Homo sapiens (Human))
Johnson And Johnson Pharmaceutical Research And Development
Curated by ChEMBL
LigandPNGBDBM50182120(1-(3-(4-bromophenyl)-5-(methylsulfonyl)-4,5,6,7-te...)
Affinity DataIC50:  322nM. Assay description: Inhibition of cathepsin S
In DepthDetails ArticlePubMed