BDBM50182258 CHEMBL3819382
SMILES CCN1CCN(CC1)S(=O)(=O)c1c(Cl)ccc(NC(=O)Nc2cccc(F)c2Cl)c1O
InChI Key InChIKey=LOVUHVWQSNBKMI-UHFFFAOYSA-N
Data  2 IC50
  Tab Delimited (TSV)   2D SDfile   Computed 3D by Vconf -m prep SDfile
Find this compound or compounds like it in BindingDB:
Activity Spreadsheet -- Enzyme Inhibition Constant Data from BindingDB
Found 2 hits for monomerid = 50182258
TargetC-X-C chemokine receptor type 2(Homo sapiens (Human))
Peking Union Medical College And Chinese Academy Of Medical Sciences
Curated by ChEMBL
LigandPNGBDBM50182258(CHEMBL3819382)
Affinity DataIC50:  2.00E+3nM. Assay description: Antagonist activity at human recombinant CXCR2 assessed as inhibition of CXCL1-induced neutrophil chemotaxis after 45 mins by calcein-AM dye based pl...
In DepthDetails ArticlePubMed
TargetC-X-C chemokine receptor type 2(Homo sapiens (Human))
Peking Union Medical College And Chinese Academy Of Medical Sciences
Curated by ChEMBL
LigandPNGBDBM50182258(CHEMBL3819382)
Affinity DataIC50:  1nM. Assay description: Antagonist activity at human recombinant Gal4-VP16 fused-CXCR2 assessed as inhibition of CXCL1-mediated lactamase reporter gene expression after over...
In DepthDetails ArticlePubMed