BDBM50182283 CHEMBL3819313
SMILES Cl.[#6]-[#8]-c1ccc(-[#6]-[#6]-[#7]-c2nc(-[#7])c(nc2Cl)-[#6](=O)\[#7]=[#6](\[#7])-[#7])cc1
InChI Key InChIKey=VSOKGRSKVWZQKE-UHFFFAOYSA-N
Data  2 IC50
  Tab Delimited (TSV)   2D SDfile   Computed 3D by Vconf -m prep SDfile
Find this compound or compounds like it in BindingDB:
Activity Spreadsheet -- Enzyme Inhibition Constant Data from BindingDB
Found 2 hits for monomerid = 50182283
TargetAdenosine receptor A2a/A2b(Homo sapiens (Human))
Leiden University
Curated by ChEMBL
LigandPNGBDBM50182283(CHEMBL3819313)
Affinity DataIC50:  120nM. Assay description: Displacement of [3H]ZM-241,385 from human N-terminal FLAG-tagged adenosine A2A receptor W246A 6.48 mutant expressed in HEK293 cell membrane by microb...
In DepthDetails ArticlePubMed
TargetAdenosine receptor A2a(Homo sapiens (Human))
Leiden University
Curated by ChEMBL
LigandPNGBDBM50182283(CHEMBL3819313)
Affinity DataIC50:  4.40E+3nM. Assay description: Displacement of [3H]ZM-241,385 from human N-terminal FLAG-tagged adenosine A2A receptor expressed in HEK293 cell membrane by microbeta scintillation ...
In DepthDetails ArticlePubMed