BDBM50182445 CHEMBL3819220
SMILES COc1ccc2C\C(=C/C3CCN(Cc4ccccc4)CC3)C(=O)c2c1
InChI Key InChIKey=DPIFFAVGHCOCCC-DEDYPNTBSA-N
Data  2 KI  2 IC50
  Tab Delimited (TSV)   2D SDfile   Computed 3D by Vconf -m prep SDfile
Find this compound or compounds like it in BindingDB:
Activity Spreadsheet -- Enzyme Inhibition Constant Data from BindingDB
Found 4 hits for monomerid = 50182445
TargetAcetylcholinesterase(Homo sapiens (Human))
Universit£
Curated by ChEMBL
LigandPNGBDBM50182445(CHEMBL3819220)
Affinity DataKi:  260nM. Assay description: Non-competitive inhibition of human erythrocytes AchE using acetylthiocholine iodide as substrate incubated for 20 mins by Lineweaver-Burk plot analy...
In DepthDetails ArticlePubMed
TargetCholinesterase(Equus caballus (Horse))
Universit£
Curated by ChEMBL
LigandPNGBDBM50182445(CHEMBL3819220)
Affinity DataKi:  1.14E+3nM. Assay description: Mixed inhibition of horse serum BuChE using butyrylthiocoline iodide as substrate incubated for 20 mins by Lineweaver-Burk plot analysis
In DepthDetails ArticlePubMed
TargetAcetylcholinesterase(Homo sapiens (Human))
Universit£
Curated by ChEMBL
LigandPNGBDBM50182445(CHEMBL3819220)
Affinity DataIC50:  342nM. Assay description: Inhibition of human erythrocytes AchE using acetylthiocholine iodide as substrate incubated for 20 mins by Ellman method
In DepthDetails ArticlePubMed
TargetCholinesterase(Equus caballus (Horse))
Universit£
Curated by ChEMBL
LigandPNGBDBM50182445(CHEMBL3819220)
Affinity DataIC50:  2.65E+3nM. Assay description: Inhibition of horse serum BuChE using butyrylthiocoline iodide as substrate incubated for 20 mins by Ellman method
In DepthDetails ArticlePubMed