BDBM50182600 1-(4-(4-benzoylbenzyloxy)-6-hydroxy-7-methoxybenzofuran-5-yl)ethanone::CHEMBL201808
SMILES COc1c(O)c(C(C)=O)c(OCc2ccc(cc2)C(=O)c2ccccc2)c2ccoc12
InChI Key InChIKey=YUUWUJYKCMALTL-UHFFFAOYSA-N
Data  1 EC50
  Tab Delimited (TSV)   2D SDfile   Computed 3D by Vconf -m prep SDfile
Find this compound or compounds like it in BindingDB:
Activity Spreadsheet -- Enzyme Inhibition Constant Data from BindingDB
Found 1 hit for monomerid = 50182600
TargetPotassium voltage-gated channel subfamily A member 3(Mus musculus)
Institute Of Medical Research Biotechnology Centre
Curated by ChEMBL
LigandPNGBDBM50182600(1-(4-(4-benzoylbenzyloxy)-6-hydroxy-7-methoxybenzo...)
Affinity DataEC50:  500nM. Assay description: Effect on blockade of mouse Kv1.3 channel expressed in L929 cells
In DepthDetails ArticlePubMed