BDBM50182715 4-CHLORO-6-(4-PIPERAZIN-1-YL-1H-PYRAZOL-5-YL)BENZENE-1,3-DIOL::4-chloro-6-(4-(piperazin-1-yl)-1H-pyrazol-3-yl)benzene-1,3-diol::CHEMBL380888
SMILES Oc1cc(O)c(cc1Cl)-c1n[nH]cc1N1CCNCC1
InChI Key InChIKey=RFPHEBUOQYYPDO-UHFFFAOYSA-N
Data  2 IC50
  Tab Delimited (TSV)   2D SDfile   Computed 3D by Vconf -m prep SDfile
Find this compound or compounds like it in BindingDB:
Activity Spreadsheet -- Enzyme Inhibition Constant Data from BindingDB
Found 2 hits for monomerid = 50182715
TargetHeat shock protein HSP 90-alpha/90-beta(Homo sapiens (Human))
Vernalis
Curated by ChEMBL
LigandPNGBDBM50182715(4-CHLORO-6-(4-PIPERAZIN-1-YL-1H-PYRAZOL-5-YL)BENZE...)
Affinity DataIC50:  8.20E+3nM. Assay description: Inhibition of HSP90 ATPase activity
In DepthDetails ArticlePubMed
TargetHeat shock protein HSP 90-alpha/90-beta(Homo sapiens (Human))
Vernalis
Curated by ChEMBL
LigandPNGBDBM50182715(4-CHLORO-6-(4-PIPERAZIN-1-YL-1H-PYRAZOL-5-YL)BENZE...)
Affinity DataIC50:  2.00E+3nM. Assay description: Inhibition of HSP90 by FP assay
In DepthDetails ArticlePubMed