BDBM50182732 CHEMBL3819244
SMILES CC[C@H](C)[C@H](NC(=O)[C@H](CC(C)C)NC(=O)[C@H](C)NC(=O)c1ccc(CN2CCNCC2)cc1)C(=O)N[C@@H](Cc1ccccc1)C(O)=O
InChI Key InChIKey=XGNKIGWUPOAWNI-YUFMXMPISA-N
Data  2 IC50
  Tab Delimited (TSV)   2D SDfile   Computed 3D by Vconf -m prep SDfile
Find this compound or compounds like it in BindingDB:
Activity Spreadsheet -- Enzyme Inhibition Constant Data from BindingDB
Found 2 hits for monomerid = 50182732
TargetCyclin-dependent kinase 4/G1/S-specific cyclin-D1(Homo sapiens (Human))
University Of South Carolina
Curated by ChEMBL
LigandPNGBDBM50182732(CHEMBL3819244)
Affinity DataIC50:  5.15E+4nM. Assay description: Inhibition of recombinant human CDK4/cyclin D1 using fluoresceinyl-AhxPro-Val-Lys-Arg-Arg-Leu-(3ClPhe)-Gly as substrate incubated for 45 mins by fluo...
In DepthDetails ArticlePubMed
TargetCyclin-A2/Cyclin-dependent kinase 2(Homo sapiens (Human))
University Of South Carolina
Curated by ChEMBL
LigandPNGBDBM50182732(CHEMBL3819244)
Affinity DataIC50: >1.00E+5nM. Assay description: Inhibition of recombinant human CDK2/cyclin A2 using fluoresceinyl-Ahx-Pro-Val-Lys-Arg-Arg-Leu-Phe-Gly as substrate incubated for 45 mins by fluoresc...
In DepthDetails ArticlePubMed