BDBM50182916 1-methyl-6-({[(methylamino)oxy]carbonyl}amino)-1H-indole-3-carbonitrile::CHEMBL378169
SMILES CNOC(=O)Nc1ccc2c(cn(C)c2c1)C#N
InChI Key InChIKey=GENPGEBTCIIZTN-UHFFFAOYSA-N
Data  1 IC50
  Tab Delimited (TSV)   2D SDfile   Computed 3D by Vconf -m prep SDfile
Find this compound or compounds like it in BindingDB:
Activity Spreadsheet -- Enzyme Inhibition Constant Data from BindingDB
Found 1 hit for monomerid = 50182916
TargetInosine-5'-monophosphate dehydrogenase 2(Homo sapiens (Human))
Ucb Pharma
Curated by ChEMBL
LigandPNGBDBM50182916(1-methyl-6-({[(methylamino)oxy]carbonyl}amino)-1H-...)
Affinity DataIC50:  4.04E+3nM. Assay description: Inhibition of IMPDH2
In DepthDetails ArticlePubMed