BDBM50182973 (2S,3S,4R,5R)-5-(2-(2-(1-aminocyclohexyl)ethynyl)-6-(ethylamino)-9H-purin-9-yl)-N-ethyl-3,4-dihydroxy-tetrahydrofuran-2-carboxamide::CHEMBL378367
SMILES CCNC(=O)[C@H]1O[C@H]([C@H](O)[C@@H]1O)n1cnc2c(NCC)nc(nc12)C#CC1(N)CCCCC1
InChI Key InChIKey=CQPKMYIGFLVCFM-GRXQJBFDSA-N
Data  3 KI
  Tab Delimited (TSV)   2D SDfile   Computed 3D by Vconf -m prep SDfile
Find this compound or compounds like it in BindingDB:
Activity Spreadsheet -- Enzyme Inhibition Constant Data from BindingDB
Found 3 hits for monomerid = 50182973
TargetAdenosine receptor A3(Homo sapiens (Human))
University Of Virginia
Curated by ChEMBL
LigandPNGBDBM50182973((2S,3S,4R,5R)-5-(2-(2-(1-aminocyclohexyl)ethynyl)-...)
Affinity DataKi:  27.2nM. Assay description: Displacement of [125I]ABA from human adenosine A3 receptor expressed in HEK cells
In DepthDetails ArticlePubMed
TargetAdenosine receptor A1(Homo sapiens (Human))
University Of Virginia
Curated by ChEMBL
LigandPNGBDBM50182973((2S,3S,4R,5R)-5-(2-(2-(1-aminocyclohexyl)ethynyl)-...)
Affinity DataKi:  716nM. Assay description: Displacement of [125I]ABA from human adenosine A1 receptor expressed in HEK cells
In DepthDetails ArticlePubMed
TargetAdenosine receptor A2a(Homo sapiens (Human))
University Of Virginia
Curated by ChEMBL
LigandPNGBDBM50182973((2S,3S,4R,5R)-5-(2-(2-(1-aminocyclohexyl)ethynyl)-...)
Affinity DataKi:  7.35E+3nM. Assay description: Displacement of [125I]ZM241385 from human adenosine A2A receptor in HEK cells
In DepthDetails ArticlePubMed