BDBM50182985 (2S,3S,4R,5R)-5-(2-((R,S)-3-cyclopentyl-3-hydroxyprop-1-ynyl)-6-(ethylamino)-9H-purin-9-yl)-N-ethyl-3,4-dihydroxy-tetrahydrofuran-2-carboxamide::CHEMBL208160
SMILES CCNC(=O)[C@H]1O[C@H]([C@H](O)[C@@H]1O)n1cnc2c(NCC)nc(nc12)C#CC(O)C1CCCC1
InChI Key InChIKey=FQBRFEMDBUBWQS-WNQWXAGVSA-N
Data  4 KI
  Tab Delimited (TSV)   2D SDfile   Computed 3D by Vconf -m prep SDfile
Find this compound or compounds like it in BindingDB:
Activity Spreadsheet -- Enzyme Inhibition Constant Data from BindingDB
Found 4 hits for monomerid = 50182985
TargetAdenosine receptor A3(Homo sapiens (Human))
University Of Virginia
Curated by ChEMBL
LigandPNGBDBM50182985((2S,3S,4R,5R)-5-(2-((R,S)-3-cyclopentyl-3-hydroxyp...)
Affinity DataKi:  1.84nM. Assay description: Displacement of [125I]ABA from human adenosine A3 receptor expressed in HEK cells
In DepthDetails ArticlePubMed
TargetAdenosine receptor A1(Homo sapiens (Human))
University Of Virginia
Curated by ChEMBL
LigandPNGBDBM50182985((2S,3S,4R,5R)-5-(2-((R,S)-3-cyclopentyl-3-hydroxyp...)
Affinity DataKi:  6.81nM. Assay description: Displacement of [125I]ABA from human adenosine A1 receptor expressed in HEK cells
In DepthDetails ArticlePubMed
TargetAdenosine receptor A2a(Homo sapiens (Human))
University Of Virginia
Curated by ChEMBL
LigandPNGBDBM50182985((2S,3S,4R,5R)-5-(2-((R,S)-3-cyclopentyl-3-hydroxyp...)
Affinity DataKi:  152nM. Assay description: Displacement of [125I]ZM241385 from human adenosine A2A receptor in HEK cells
In DepthDetails ArticlePubMed
TargetAdenosine receptor A2b(Homo sapiens (Human))
University Of Virginia
Curated by ChEMBL
LigandPNGBDBM50182985((2S,3S,4R,5R)-5-(2-((R,S)-3-cyclopentyl-3-hydroxyp...)
Affinity DataKi:  7.92E+3nM. Assay description: Displacement of [125I]ABOPX from human adenosine A2B receptor in HEK cells
In DepthDetails ArticlePubMed