BDBM50183057 CHEMBL3818765
SMILES CCc1cc(CC(NC(C)=O)C(=O)NCCCCC(=O)NC(CCSC)C(O)=O)ccc1N(C(=O)C(O)=O)c1ccccc1C(O)=O
InChI Key InChIKey=JYWLVKREVMTEJA-UHFFFAOYSA-N
Data  2 KI
PDB links: 1 PDB ID matches this monomer.
  Tab Delimited (TSV)   2D SDfile   Computed 3D by Vconf -m prep SDfile
Find this compound or compounds like it in BindingDB:
Activity Spreadsheet -- Enzyme Inhibition Constant Data from BindingDB
Found 2 hits for monomerid = 50183057
TargetTyrosine-protein phosphatase non-receptor type 1(Homo sapiens (Human))
Chinese Academy Of Sciences
Curated by ChEMBL
LigandPNGBDBM50183057(CHEMBL3818765)
Affinity DataKi:  76nM. Assay description: Inhibition of PTP1B (unknown origin) using p-nitrophenyl phosphate as substrate by colorimetric method
TargetTyrosine-protein phosphatase non-receptor type 2(Homo sapiens (Human))
Chinese Academy Of Sciences
Curated by ChEMBL
LigandPNGBDBM50183057(CHEMBL3818765)
Affinity DataKi:  380nM. Assay description: Inhibition of TCPTP (unknown origin) using p-nitrophenyl phosphate as substrate by colorimetric method
In DepthDetails ArticlePubMed