BDBM50183059 CHEMBL3818451
SMILES CCCCCNC(=O)[C@H](Cc1ccc(C(=O)C(=O)Nc2ccccc2C(O)=O)c(\C=C\C(N)=O)c1)NS(C)(=O)=O
InChI Key InChIKey=NZHOJYVDRHNLLO-SDNYCIMKSA-N
Data  2 KI
  Tab Delimited (TSV)   2D SDfile   Computed 3D by Vconf -m prep SDfile
Find this compound or compounds like it in BindingDB:
Activity Spreadsheet -- Enzyme Inhibition Constant Data from BindingDB
Found 2 hits for monomerid = 50183059
TargetTyrosine-protein phosphatase non-receptor type 2(Homo sapiens (Human))
Chinese Academy Of Sciences
Curated by ChEMBL
LigandPNGBDBM50183059(CHEMBL3818451)
Affinity DataKi:  160nM. Assay description: Inhibition of TCPTP (unknown origin) using p-nitrophenyl phosphate as substrate by colorimetric method
In DepthDetails ArticlePubMed
TargetTyrosine-protein phosphatase non-receptor type 1(Homo sapiens (Human))
Chinese Academy Of Sciences
Curated by ChEMBL
LigandPNGBDBM50183059(CHEMBL3818451)
Affinity DataKi:  170nM. Assay description: Inhibition of human PTP1B (1 to 288 residues) expressed in Escherichia coli BL21 (DE3) cells using p-nitrophenyl phosphate as substrate by colorimetr...
In DepthDetails ArticlePubMed