BDBM50183098 4-tert-butyl-N-(2,3-dimethylphenyl)thiazol-2-amine::CHEMBL206789
SMILES Cc1cccc(Nc2nc(cs2)C(C)(C)C)c1C
InChI Key InChIKey=DNOVKAUCGLWSEE-UHFFFAOYSA-N
Data  1 IC50
  Tab Delimited (TSV)   2D SDfile   Computed 3D by Vconf -m prep SDfile
Find this compound or compounds like it in BindingDB:
Activity Spreadsheet -- Enzyme Inhibition Constant Data from BindingDB
Found 1 hit for monomerid = 50183098
TargetC-C chemokine receptor type 4(Homo sapiens (Human))
Amgen
Curated by ChEMBL
LigandPNGBDBM50183098(4-tert-butyl-N-(2,3-dimethylphenyl)thiazol-2-amine...)
Affinity DataIC50:  260nM. Assay description: Displacement of [125I]TARC from CCR4 expressed in human CEM cell line
In DepthDetails ArticlePubMed