BDBM50183481 2-[3-(benzoylamino)-2-thienyl]-5,6-dihydroxypyrimidine-4-carboxylic acid::CHEMBL206569
SMILES OC(=O)c1nc([nH]c(=O)c1O)-c1sccc1NC(=O)c1ccccc1
InChI Key InChIKey=VRUFAVXVBJJZDM-UHFFFAOYSA-N
Data  1 EC50
  Tab Delimited (TSV)   2D SDfile   Computed 3D by Vconf -m prep SDfile
Find this compound or compounds like it in BindingDB:
Activity Spreadsheet -- Enzyme Inhibition Constant Data from BindingDB
Found 1 hit for monomerid = 50183481
TargetRNA-directed RNA polymerase(Hepatitis C virus)
P. Angeletti S.P.A. (Merck Research Laboratories)
Curated by ChEMBL
LigandPNGBDBM50183481(2-[3-(benzoylamino)-2-thienyl]-5,6-dihydroxypyrimi...)
Affinity DataEC50: >5.00E+4nM. Assay description: Inhibitory activity against HCV 1b BK NS5B deltaC55 RNA polymerase
In DepthDetails ArticlePubMed