BDBM50183588 CHEMBL203930::c[RG-(R)-alpha-TfmDfV]
SMILES [#6]-[#6](-[#6])-[#6@@H]-1-[#7]-[#6](=O)-[#6@@H](-[#6]-c2ccccc2)-[#7]-[#6](=O)[C@@]([#6]-[#6](-[#8])=O)([#7]-[#6]-[#6]-[#7]-[#6](=O)-[#6@H](-[#6]-[#6]-[#6]\[#7]=[#6](\[#7])-[#7])-[#7]-[#6]-1=O)C(F)(F)F
InChI Key InChIKey=DOBAGVTXMCAPCK-TZHNIEJDSA-N
Data  2 IC50
  Tab Delimited (TSV)   2D SDfile   Computed 3D by Vconf -m prep SDfile
Find this compound or compounds like it in BindingDB:
Activity Spreadsheet -- Enzyme Inhibition Constant Data from BindingDB
Found 2 hits for monomerid = 50183588
TargetIntegrin alpha-V/beta-5(Homo sapiens (Human))
Istituto Di Ricerche Chimiche E Biochimiche G. Ronzoni
Curated by ChEMBL
LigandPNGBDBM50183588(CHEMBL203930 | c[RG-(R)-alpha-TfmDfV])
Affinity DataIC50: >1.00E+3nM. Assay description: Displacement of [125I]echistatin from AlphaVbeta5 integrin receptor
In DepthDetails ArticlePubMed
TargetIntegrin alpha-V/beta-3(Homo sapiens (Human))
Istituto Di Ricerche Chimiche E Biochimiche G. Ronzoni
Curated by ChEMBL
LigandPNGBDBM50183588(CHEMBL203930 | c[RG-(R)-alpha-TfmDfV])
Affinity DataIC50: >1.00E+3nM. Assay description: Displacement of [125I]echistatin from AlphaVbeta3 integrin receptor
In DepthDetails ArticlePubMed